[ODE] unresolved external symbol __ftol2

slipch slipch <slipch at gsc-game.kiev.ua>
Wed Nov 27 02:18:02 2002

Hello ODE,

I can not build last ode version with MS  VC 6.0.

link /dll /nologo /SUBSYSTEM:WINDOWS /LIBPATH:"C:\Programme\Micros~2\VC98\Lib" /
def:config/msvcdefs.def Comctl32.lib kernel32.lib user32.lib gdi32.lib OpenGL32.
lib Glu32.lib /OUT:lib/ode.dll ode/src/array.obj ode/src/error.obj ode/src/memor
y.obj ode/src/obstack.obj ode/src/odemath.obj ode/src/matrix.obj ode/src/misc.ob
j ode/src/rotation.obj ode/src/mass.obj ode/src/ode.obj ode/src/step.obj ode/src
/lcp.obj ode/src/joint.obj ode/src/timer.obj ode/src/mat.obj ode/src/testing.obj
 ode/src/collision_kernel.obj ode/src/collision_util.obj ode/src/collision_std.o
bj ode/src/collision_space.obj ode/src/collision_transform.obj ode/src/fastldlt.
obj ode/src/fastlsolve.obj ode/src/fastltsolve.obj ode/src/fastdot.obj
   Creating library lib/ode.lib and object lib/ode.exp
LINK : warning LNK4049: locally defined symbol "_dInfinityValue" imported
misc.obj : error LNK2001: unresolved external symbol __ftol2
collision_space.obj : error LNK2001: unresolved external symbol __ftol2
lib/ode.dll : fatal error LNK1120: 1 unresolved externals
make: *** [lib/ode.lib] Error 1120

I also can not find any reference on even occurrence of  "__ftol2".
I will very appreciate any suggestion.
Best regards,
 slipch                          mailto:slipch@gsc-game.kiev.ua